{"text_format":"1","workbook":"xlsx","n_sheets":9,"sheets":["Saisie","Resultat","Autocad_Pts","Autocad_Num","Autocad_Txt_Altitude","Script","Protocole de terrain vierge (2)","Protocole de terrain vierge","Protocole de terrain"],"not_rendered":{"charts":0,"images":0,"macros":1,"external_links":0,"defined_names":8,"comments":0,"pivot_tables":0},"unopened":[],"bounds":{"document_bytes":16777216,"sheet_cells":100000,"rows_first":2000,"rows_last":500,"rows_between":2000,"halvings":0,"cell_chars":16384,"cell_head_chars":4096},"cells_cut":0,"cells_raw":0,"read":"row_number_cap","date_system":"1900"}

{"sheet":"Saisie","index":0,"n_rows":65,"n_cols":19,"rows_kept":65,"cut":false,"hidden":false,"merged":[]}
[null,null,null,"Calcul des coordonnées et altitudes des points relevés au niveau, en station libre vers deux points connus."]
[null,null,null,null,null,null,null,null,null,null,null,"ro",null,null,null,null,null,null,"Degré"]
[null,"Affaire:",null,null,"Opérateurs",null,null,null,null,null,null,{"$f":"IF(C7=\"Degré\",180/PI(),200/PI())","v":57.295779513082323},null,"tol calage",null,null,"Gisements d'orientation: ",null,"Grade"]
[null,null,null,null,null,null,null,null,null,null,null,null,null,0.05,null,"global:",{"$f":"ATAN2(M11-Cn,L11-Ce)*ro","v":100.40295890307242},{"$f":"IF(ro<60,\"Degrés\",\"Grades\")","v":"Degrés"}]
[null,"Date",null,null,"Instrument",null,null,null,null,null,null,null,null,null,null,"local:",{"$f":"ATAN2(K11-K10,J11-J10)*ro","v":-83.453595810356347},{"$f":"IF(ro<60,\"Degrés\",\"Grades\")","v":"Degrés"}]
[null,null,"Choisir:",null,null,null,null,null,null,null,null,null,null,null,null,"j0:",{"$f":"Q4-Q5","v":183.85655471342875},{"$f":"IF(ro<60,\"Degrés\",\"Grades\")","v":"Degrés"}]
[null,"Unité","Degré",null,{"$f":"IF((Q10^2+Q11^2)^0.5>tolerance,\"Mauvais calage !\",\"\")","v":"Mauvais calage !"},null,null,null,null," Altitude de l'","axe de visée:",{"$f":"N10+G10/1000","v":401.93900000000002},{"$f":"N11+G11/1000","v":401.76400000000001},{"$f":"(L7+M7)/2","v":401.85149999999999},null,"j0:",{"$f":"Q6/ro","v":3.2089022311224311},"Radians"]
[null,null,null,null,{"$f":"IF(L8/M8>1.5,\"Extrapolation dangereuse !\",\"\")","v":"Extrapolation dangereuse !"},null,null,null,null," Emprise Levé - Base :",null,{"$f":"((MAX(L10:L60)-MIN(L10:L60))^2+(MAX(M10:M60)-MIN(M10:M60))^2)^0.5","v":71.289773894164611},{"$f":"((L11-Ce)^2+(M11-Cn)^2)^0.5","v":8.9470706314220525},null,null,"Y0:",{"$f":"Ce-J10*COS(Q7)-K10*SIN(Q7)","v":2502114.4093139139}]
["Li","Numéro","Direction","Bas","Milieu","Haut","Moy","Fiab","Dist","V","U","Est","Nord","Altitude",null,"X0:",{"$f":"Cn+J10*SIN(Q7)-K10*COS(Q7)","v":1201071.9612393661}]
[1,8031,115.3,1856,1940,2021,{"$f":"IF(F10=\"\",\"\",(D10+E10+F10)/3)","v":1939},{"$f":"IF(F10=\"\",\"\",ABS(G10-E10))","v":1},{"$f":"IF(F10=\"\",\"\",ABS(F10-D10)/10)","v":16.5},{"$f":"IF(F10=\"\",\"\",I10*SIN(C10/ro))","v":14.917362069402843},{"$f":"IF(F10=\"\",\"\",I10*COS(C10/ro))","v":-7.0514047458886742},2502100,1201080,400,"< Point fixe 1","Ecart plani=",{"$f":"ABS(((L11-Ce)^2+(M11-Cn)^2)^0.5-((J11-J10)^2+(K11-K10)^2)^0.5)","v":11.089405658371641},"Mètres"]
[2,8062,226.3,1680,1713,1749,{"$f":"IF(F11=\"\",\"\",(D11+E11+F11)/3)","v":1714},1,{"$f":"IF(F11=\"\",\"\",ABS(F11-D11)/10)","v":6.9},-4.9884733067760214,-4.767088636430322,2502108.7999999998,1201078.3844280001,400.05,"< Point fixe 2","Ecart altim=",{"$f":"L7-M7","v":0.17500000000001137},"Mètres"]
[3,44,290.5,1090,1140,1192,{"$f":"IF(F12=\"\",\"\",(D12+E12+F12)/3)","v":1140.6666666666667},0.66666666666674246,{"$f":"IF(F12=\"\",\"\",ABS(F12-D12)/10)","v":10.199999999999999},-9.5540563303336565,3.5721152888465655,{"$f":"IF(F12=\"\",\"\",$Q$8+J12*COS($Q$7)+K12*SIN($Q$7))","v":2502123.701479651},{"$f":"IF(F12=\"\",\"\",$Q$9-J12*SIN($Q$7)+K12*COS($Q$7))","v":1201067.7546188801},{"$f":"IF(F12=\"\",\"\",$N$7-G12/1000)","v":400.71083333333331}]
[4,45,295.7,1172,1199,1225,{"$f":"IF(F13=\"\",\"\",(D13+E13+F13)/3)","v":1198.6666666666667},0.33333333333325754,{"$f":"IF(F13=\"\",\"\",ABS(F13-D13)/10)","v":5.3},-4.7757082130070865,2.2983931483139823,{"$f":"IF(F13=\"\",\"\",$Q$8+J13*COS($Q$7)+K13*SIN($Q$7))","v":2502119.0196207664},{"$f":"IF(F13=\"\",\"\",$Q$9-J13*SIN($Q$7)+K13*COS($Q$7))","v":1201069.3468425479},{"$f":"IF(F13=\"\",\"\",$N$7-G13/1000)","v":400.65283333333332},null,"1) Introduire l'unité de mesure"]
[5,46,91.3,1385,1407,1428,1406.6666666666667,0.33333333333325754,4.3,4.2988932200876029,-9.7555534362959218E-2,2502110.1267167204,1201072.347712236,400.44483333333329,null,"de la lunette."]
[6,47,96.7,1338,1382,1426,1382,0,8.8000000000000007,8.7399017159386787,-1.0267024864741319,2502105.7582578729,1201073.5734519372,400.46949999999998]
[7,48,98.5,1402,1473,1548,{"$f":"IF(F16=\"\",\"\",(D16+E16+F16)/3)","v":1474.3333333333333},1.3333333333332575,{"$f":"IF(F16=\"\",\"\",ABS(F16-D16)/10)","v":14.6},{"$f":"IF(F16=\"\",\"\",I16*SIN(C16/ro))","v":14.439631605083985},{"$f":"IF(F16=\"\",\"\",I16*COS(C16/ro))","v":-2.1580174024923156},{"$f":"IF(F16=\"\",\"\",$Q$8+J16*COS($Q$7)+K16*SIN($Q$7))","v":2502100.1475254917},{"$f":"IF(F16=\"\",\"\",$Q$9-J16*SIN($Q$7)+K16*COS($Q$7))","v":1201075.0855618513},{"$f":"IF(F16=\"\",\"\",$N$7-G16/1000)","v":400.37716666666665},null,"2) Saisir les mesures de chaque point dans "]
[8,49,100,1404,1502,1600,1502,0,19.600000000000001,19.302231959039279,-3.4035042822718342,2502095.3797060852,1201076.6552808965,400.34949999999998,null,"les cellules blanches (pas de lignes vides)."]
[9,50,100.5,1375,1498,1618,1497,1,24.3,23.893094253804097,-4.4283232694591792,2502090.8681675554,1201077.986554971,400.35449999999997]
[10,51,101,1370,1510,1650,1510,0,28,27.485561136534592,-5.3426518705432544,2502087.3453321899,1201079.1404380163,400.3415,null,"3) Vérifier les écarts affichés. "]
[11,52,103,1538,1670,1802,1670,0,26.4,25.723369710330211,-5.9387078346780369,2502089.143623237,1201079.616621434,400.18149999999997,null,"L'écart total ne doit pas dépasser"]
[12,53,121,2045,2182,2320,2182.3333333333335,0.33333333333348492,27.5,23.57210076930809,-14.163547060026492,2502091.843213289,1201087.67814436,399.66916666666663,null,"la tolérance."]
[13,54,106.7,1512,1546,1582,1546.6666666666667,{"$f":"IF(F22=\"\",\"\",ABS(G22-E22))","v":0.66666666666674246},7,6.7047574639172041,-2.0115236389479838,2502107.8550315276,1201074.4191617402,400.30483333333331]
[14,55,106.5,1846,2000,2150,1998.6666666666667,1.3333333333332575,30.4,29.148119939993066,-8.6340664789992481,2502085.9079146199,1201082.5362210821,399.85283333333331,null,"4) Vérifier que la colonne rouge a bien entièrement"]
[15,56,114.3,2050,2210,2365,2208.3333333333335,1.6666666666665151,31.5,28.709203214016526,-12.962702296060925,2502086.6369761419,1201086.8255339905,399.64316666666667,null,"disparu (fiabilité de tous les points). Dans le cas"]
[16,57,119.5,2090,2250,2410,2250,0,32,27.85138227007679,-15.757553923310944,2502087.6808328722,1201089.5563608829,399.60149999999999,null,"contraire, vérifier la saisie du point signalé, puis,"]
[17,58,152,1830,1870,1912,1870.6666666666667,0.66666666666674246,8.1999999999999993,3.8496668148443032,-7.2401702614432004,2502111.0553293186,1201079.4439385675,399.98083333333329,null,"si l'erreur persiste, mettez un point d'interrogation"]
[18,59,147,2310,2410,2510,2410,0,20,10.892780700300547,-16.773411358908479,2502104.6693581147,1201089.4293033984,399.44149999999996,null,"à la fin du numéro du point (sans espace). Par "]
[19,60,138,2352,2475,2600,2475.6666666666665,0.66666666666651508,24.8,16.594439037699686,-18.429991671839371,2502099.0920303534,1201091.465618985,399.37583333333333,null,"exemple, 6 devient 6?."]
[20,61,241,1206,1278,1348,1277.3333333333333,0.66666666666674246,14.2,-12.419599841379423,-6.8842966074979826,2502127.2638196643,1201077.9946200026,400.57416666666666]
[21,null,null,null,null,null,"","","","","","","","",null,"5) Renseigner les coordonnées des"]
[22,null,null,null,null,null,"","","","","","","","",null,"points de calage (ici en rouge)"]
[23,null,null,null,null,null,"","","","","","","",""]
[24,null,null,null,null,null,"","","","","","","","",null,"6) Enregistrez la feuille au format normal."]
[25,null,null,null,null,null,"","","","","","","",""]
[26,null,null,null,null,null,"","","","","","","","",null,"7) Enregistrez la feuille Resultat au format .txt"]
[27,null,null,null,null,null,"","","","","","","","",null,"si vous envisagez un transfert des points vers un autre logiciel"]
[28,null,null,null,null,null,"","","","","","","",""]
[29,null,null,null,null,null,"","","","","","","","",null,"8) Enregistrez les feuilles Autocad…  au format .txt"]
[30,null,null,null,null,null,"","","","","","","","",null,"si vous envisagez un transfert des points vers "]
[31,null,null,null,null,null,"","","","","","","","",null,"Autocad. Il faudra alors changer l'extension .txt"]
[32,null,null,null,null,null,"","","","","","","","",null,"en .scr, puis, dans Autocad, faire Outils - Script."]
[33,null,null,null,null,null,"","","",{"$f":"IF(F42=\"\",\"\",I42*SIN(C42/ro))","v":""},{"$f":"IF(F42=\"\",\"\",I42*COS(C42/ro))","v":""},"","",""]
[34,null,null,null,null,null,"","","","","","","",""]
[35,null,null,null,null,null,"","","","","","","","",null,null," paramètre"]
[36,null,null,null,null,null,"","","","","","","",""]
[37,null,null,null,null,null,"","","","","","","","",null,null," calculé"]
[38,null,null,null,null,null,"","","","","","","",""]
[39,null,null,null,null,null,"","","","","","","","",null,null," à saisir"]
[40,null,null,null,null,null,"","","","","","","",""]
[41,null,null,null,null,null,"","","","","","","","",null,1234.56," Coordonnées  connues"]
[42,null,null,null,null,null,"","","","","","","","",null,null," à introduire"]
[43,null,null,null,null,null,"","","","","","","",""]
[44,null,null,null,null,null,"","","","","","","","",null,"8) Analyse"]
[45,null,null,null,null,null,"","","","","","","","",null,"Extrapolation dangereuse !"]
[46,null,null,null,null,null,"","","","","","","","",null,"Ceci veut dire que vous dépassez de plus de 1.5x la distance de la base"]
[47,null,null,null,null,null,"","","","","","","","",null,"Mauvais calage !"]
[48,null,null,null,null,null,"","","","","","","","",null,"Ceci veut dire que la distance entre pfp n'est pas assez grande"]
[49,null,null,null,null,null,"","","","","","","",""]
[50,null,null,null,null,null,"","","","","","","",""]
[51,22222,150,1100,1400,1700,1400,0,60,29.999999999999996,-51.96152422706632,2502087.972114834,1201125.8228630403,400.45150000000001]
[]
[null,null,null,null,null,null,null,null,null,null,null,null,null,null,null,"Dans le cas d'une mise en station sur le point"]
[null,null,null,null,null,null,null,null,null,null,null,null,null,null,null,"fixe (fil à plomb au trépied), la hauteur d'instrument"]
[null,null,null,null,null,null,null,null,null,null,null,null,null,null,null,"doit être mesurée. Bas = milieu = haut = la "]
[null,null,null,null,null,null,null,null,null,null,null,null,null,null,null,"\"hauteur d'instrument\" exprimée  en mm."]

{"sheet":"Resultat","index":1,"n_rows":52,"n_cols":8,"rows_kept":52,"cut":false,"hidden":false,"merged":[]}
["numéro","coordonnée X","coordonnée Y","altitude",null,"coordonnées points","coordonnées numéros","coordonnées altitudes"]
[{"$f":"IF(Saisie!F10=\"\",\"\",Saisie!B10)","v":8031},{"$f":"IF(Saisie!L10=\"\",\"\",ROUND(Saisie!L10,2))","v":2502100},{"$f":"IF(Saisie!M10=\"\",\"\",ROUND(Saisie!M10,2))","v":1201080},{"$f":"ROUND(Saisie!N10,2)","v":400},null,{"$f":"CONCATENATE(ROUNDDOWN(B2,0),\".\",RIGHT(TEXT(B2*100,0),2),\",\",ROUNDDOWN(C2,0),\".\",RIGHT(TEXT(C2*100,0),2),\",\",ROUNDDOWN(D2,0),\".\",RIGHT(TEXT(D2*100,0),2))","v":"2502100.00,1201080.00,400.00"},{"$f":"CONCATENATE(ROUNDDOWN(B2+0.5,0),\".\",RIGHT(TEXT((B2+0.5)*100,0),2),\",\",ROUNDDOWN(C2+0.5,0),\".\",RIGHT(TEXT((C2+0.5)*100,0),2),\",\",ROUNDDOWN(D2,0),\".\",RIGHT(TEXT(D2*100,0),2))","v":"2502100.50,1201080.50,400.00"},{"$f":"CONCATENATE(ROUNDDOWN(B2+0.5,0),\".\",RIGHT(TEXT((B2+0.5)*100,0),2),\",\",ROUNDDOWN(C2-0.5,0),\".\",RIGHT(TEXT((C2-0.5)*100,0),2),\",\",ROUNDDOWN(D2,0),\".\",RIGHT(TEXT(D2*100,0),2))","v":"2502100.50,1201079.50,400.00"}]
[{"$f":"IF(Saisie!F11=\"\",\"\",Saisie!B11)","v":8062},{"$f":"IF(Saisie!L11=\"\",\"\",ROUND(Saisie!L11,2))","v":2502108.7999999998},{"$f":"IF(Saisie!M11=\"\",\"\",ROUND(Saisie!M11,2))","v":1201078.3799999999},{"$f":"ROUND(Saisie!N11,2)","v":400.05},null,{"$f":"CONCATENATE(ROUNDDOWN(B3,0),\".\",RIGHT(TEXT(B3*100,0),2),\",\",ROUNDDOWN(C3,0),\".\",RIGHT(TEXT(C3*100,0),2),\",\",ROUNDDOWN(D3,0),\".\",RIGHT(TEXT(D3*100,0),2))","v":"2502108.80,1201078.38,400.05"},"2502109.30,1201078.88,400.05","2502109.30,1201077.88,400.05"]
[{"$f":"IF(Saisie!F12=\"\",\"\",Saisie!B12)","v":44},{"$f":"IF(Saisie!L12=\"\",\"\",ROUND(Saisie!L12,2))","v":2502123.7000000002},{"$f":"IF(Saisie!M12=\"\",\"\",ROUND(Saisie!M12,2))","v":1201067.75},{"$f":"ROUND(Saisie!N12,2)","v":400.71},null,"2502123.70,1201067.75,400.71","2502124.20,1201068.25,400.71","2502124.20,1201067.25,400.71"]
[{"$f":"IF(Saisie!F13=\"\",\"\",Saisie!B13)","v":45},{"$f":"IF(Saisie!L13=\"\",\"\",ROUND(Saisie!L13,2))","v":2502119.02},{"$f":"IF(Saisie!M13=\"\",\"\",ROUND(Saisie!M13,2))","v":1201069.3500000001},{"$f":"ROUND(Saisie!N13,2)","v":400.65},null,"2502119.02,1201069.35,400.65","2502119.52,1201069.85,400.65","2502119.52,1201068.85,400.65"]
[{"$f":"IF(Saisie!F14=\"\",\"\",Saisie!B14)","v":46},{"$f":"IF(Saisie!L14=\"\",\"\",ROUND(Saisie!L14,2))","v":2502110.13},{"$f":"IF(Saisie!M14=\"\",\"\",ROUND(Saisie!M14,2))","v":1201072.3500000001},{"$f":"ROUND(Saisie!N14,2)","v":400.44},null,"2502110.13,1201072.35,400.44","2502110.63,1201072.85,400.44","2502110.63,1201071.85,400.44"]
[{"$f":"IF(Saisie!F15=\"\",\"\",Saisie!B15)","v":47},{"$f":"IF(Saisie!L15=\"\",\"\",ROUND(Saisie!L15,2))","v":2502105.7599999998},{"$f":"IF(Saisie!M15=\"\",\"\",ROUND(Saisie!M15,2))","v":1201073.57},{"$f":"ROUND(Saisie!N15,2)","v":400.47},null,"2502105.76,1201073.57,400.47","2502106.26,1201074.07,400.47","2502106.26,1201073.07,400.47"]
[{"$f":"IF(Saisie!F16=\"\",\"\",Saisie!B16)","v":48},{"$f":"IF(Saisie!L16=\"\",\"\",Saisie!L16)","v":2502100.1475254917},{"$f":"Saisie!M16","v":1201075.0855618513},{"$f":"Saisie!N16","v":400.37716666666665},null,{"$f":"CONCATENATE(ROUNDDOWN(B8,0),\".\",RIGHT(TEXT(B8*100,0),2),\",\",ROUNDDOWN(C8,0),\".\",RIGHT(TEXT(C8*100,0),2),\",\",ROUNDDOWN(D8,0),\".\",RIGHT(TEXT(D8*100,0),2))","v":"2502100.15,1201075.09,400.38"},{"$f":"CONCATENATE(ROUNDDOWN(B8+0.5,0),\".\",RIGHT(TEXT((B8+0.5)*100,0),2),\",\",ROUNDDOWN(C8+0.5,0),\".\",RIGHT(TEXT((C8+0.5)*100,0),2),\",\",ROUNDDOWN(D8,0),\".\",RIGHT(TEXT(D8*100,0),2))","v":"2502100.65,1201075.59,400.38"},{"$f":"CONCATENATE(ROUNDDOWN(B8+0.5,0),\".\",RIGHT(TEXT((B8+0.5)*100,0),2),\",\",ROUNDDOWN(C8-0.5,0),\".\",RIGHT(TEXT((C8-0.5)*100,0),2),\",\",ROUNDDOWN(D8,0),\".\",RIGHT(TEXT(D8*100,0),2))","v":"2502100.65,1201074.59,400.38"}]
[{"$f":"IF(Saisie!F17=\"\",\"\",Saisie!B17)","v":49},{"$f":"IF(Saisie!L17=\"\",\"\",Saisie!L17)","v":2502095.3797060852},{"$f":"Saisie!M17","v":1201076.6552808965},{"$f":"Saisie!N17","v":400.34949999999998},null,"2502095.38,1201076.66,400.35","2502095.88,1201077.16,400.35","2502095.88,1201076.16,400.35"]
[{"$f":"IF(Saisie!F18=\"\",\"\",Saisie!B18)","v":50},{"$f":"IF(Saisie!L18=\"\",\"\",Saisie!L18)","v":2502090.8681675554},{"$f":"Saisie!M18","v":1201077.986554971},{"$f":"Saisie!N18","v":400.35449999999997},null,"2502090.87,1201077.99,400.35","2502091.37,1201078.49,400.35","2502091.37,1201077.49,400.35"]
[{"$f":"IF(Saisie!F19=\"\",\"\",Saisie!B19)","v":51},{"$f":"IF(Saisie!L19=\"\",\"\",Saisie!L19)","v":2502087.3453321899},{"$f":"Saisie!M19","v":1201079.1404380163},{"$f":"Saisie!N19","v":400.3415},null,"2502087.35,1201079.14,400.34","2502087.85,1201079.64,400.34","2502087.85,1201078.64,400.34"]
[{"$f":"IF(Saisie!F20=\"\",\"\",Saisie!B20)","v":52},{"$f":"IF(Saisie!L20=\"\",\"\",Saisie!L20)","v":2502089.143623237},{"$f":"Saisie!M20","v":1201079.616621434},{"$f":"Saisie!N20","v":400.18149999999997},null,"2502089.14,1201079.62,400.18","2502089.64,1201080.12,400.18","2502089.64,1201079.12,400.18"]
[{"$f":"IF(Saisie!F21=\"\",\"\",Saisie!B21)","v":53},{"$f":"IF(Saisie!L21=\"\",\"\",Saisie!L21)","v":2502091.843213289},{"$f":"Saisie!M21","v":1201087.67814436},{"$f":"Saisie!N21","v":399.66916666666663},null,"2502091.84,1201087.68,399.67","2502092.34,1201088.18,399.67","2502092.34,1201087.18,399.67"]
[{"$f":"IF(Saisie!F22=\"\",\"\",Saisie!B22)","v":54},{"$f":"IF(Saisie!L22=\"\",\"\",Saisie!L22)","v":2502107.8550315276},{"$f":"Saisie!M22","v":1201074.4191617402},{"$f":"Saisie!N22","v":400.30483333333331},null,"2502107.86,1201074.42,400.30","2502108.36,1201074.92,400.30","2502108.36,1201073.92,400.30"]
[{"$f":"IF(Saisie!F23=\"\",\"\",Saisie!B23)","v":55},{"$f":"IF(Saisie!L23=\"\",\"\",Saisie!L23)","v":2502085.9079146199},{"$f":"Saisie!M23","v":1201082.5362210821},{"$f":"Saisie!N23","v":399.85283333333331},null,"2502085.91,1201082.54,399.85","2502086.41,1201083.04,399.85","2502086.41,1201082.04,399.85"]
[{"$f":"IF(Saisie!F24=\"\",\"\",Saisie!B24)","v":56},{"$f":"IF(Saisie!L24=\"\",\"\",Saisie!L24)","v":2502086.6369761419},{"$f":"Saisie!M24","v":1201086.8255339905},{"$f":"Saisie!N24","v":399.64316666666667},null,"2502086.64,1201086.83,399.64","2502087.14,1201087.33,399.64","2502087.14,1201086.33,399.64"]
[{"$f":"IF(Saisie!F25=\"\",\"\",Saisie!B25)","v":57},{"$f":"IF(Saisie!L25=\"\",\"\",Saisie!L25)","v":2502087.6808328722},{"$f":"Saisie!M25","v":1201089.5563608829},{"$f":"Saisie!N25","v":399.60149999999999},null,"2502087.68,1201089.56,399.60","2502088.18,1201090.06,399.60","2502088.18,1201089.06,399.60"]
[{"$f":"IF(Saisie!F26=\"\",\"\",Saisie!B26)","v":58},{"$f":"IF(Saisie!L26=\"\",\"\",Saisie!L26)","v":2502111.0553293186},{"$f":"Saisie!M26","v":1201079.4439385675},{"$f":"Saisie!N26","v":399.98083333333329},null,"2502111.06,1201079.44,399.98","2502111.56,1201079.94,399.98","2502111.56,1201078.94,399.98"]
[{"$f":"IF(Saisie!F27=\"\",\"\",Saisie!B27)","v":59},{"$f":"IF(Saisie!L27=\"\",\"\",Saisie!L27)","v":2502104.6693581147},{"$f":"Saisie!M27","v":1201089.4293033984},{"$f":"Saisie!N27","v":399.44149999999996},null,"2502104.67,1201089.43,399.44","2502105.17,1201089.93,399.44","2502105.17,1201088.93,399.44"]
[{"$f":"IF(Saisie!F28=\"\",\"\",Saisie!B28)","v":60},{"$f":"IF(Saisie!L28=\"\",\"\",Saisie!L28)","v":2502099.0920303534},{"$f":"Saisie!M28","v":1201091.465618985},{"$f":"Saisie!N28","v":399.37583333333333},null,"2502099.09,1201091.47,399.38","2502099.59,1201091.97,399.38","2502099.59,1201090.97,399.38"]
[{"$f":"IF(Saisie!F29=\"\",\"\",Saisie!B29)","v":61},{"$f":"IF(Saisie!L29=\"\",\"\",Saisie!L29)","v":2502127.2638196643},{"$f":"Saisie!M29","v":1201077.9946200026},{"$f":"Saisie!N29","v":400.57416666666666},null,"2502127.26,1201077.99,400.57","2502127.76,1201078.49,400.57","2502127.76,1201077.49,400.57"]
[{"$f":"IF(Saisie!F30=\"\",\"\",Saisie!B30)","v":""},{"$f":"IF(Saisie!L30=\"\",\"\",Saisie!L30)","v":""},{"$f":"Saisie!M30","v":""},{"$f":"Saisie!N30","v":""},null,{"$error":"#VALUE!"},{"$error":"#VALUE!"},{"$error":"#VALUE!"}]
[{"$f":"IF(Saisie!F31=\"\",\"\",Saisie!B31)","v":""},{"$f":"IF(Saisie!L31=\"\",\"\",Saisie!L31)","v":""},{"$f":"Saisie!M31","v":""},{"$f":"Saisie!N31","v":""},null,{"$error":"#VALUE!"},{"$error":"#VALUE!"},{"$error":"#VALUE!"}]
[{"$f":"IF(Saisie!F32=\"\",\"\",Saisie!B32)","v":""},{"$f":"IF(Saisie!L32=\"\",\"\",Saisie!L32)","v":""},{"$f":"Saisie!M32","v":""},{"$f":"Saisie!N32","v":""},null,{"$error":"#VALUE!"},{"$error":"#VALUE!"},{"$error":"#VALUE!"}]
[{"$f":"IF(Saisie!F33=\"\",\"\",Saisie!B33)","v":""},{"$f":"IF(Saisie!L33=\"\",\"\",Saisie!L33)","v":""},{"$f":"Saisie!M33","v":""},{"$f":"Saisie!N33","v":""},null,{"$error":"#VALUE!"},{"$error":"#VALUE!"},{"$error":"#VALUE!"}]
[{"$f":"IF(Saisie!F34=\"\",\"\",Saisie!B34)","v":""},{"$f":"IF(Saisie!L34=\"\",\"\",Saisie!L34)","v":""},{"$f":"Saisie!M34","v":""},{"$f":"Saisie!N34","v":""},null,{"$f":"CONCATENATE(ROUNDDOWN(B26,0),\".\",RIGHT(TEXT(B26*100,0),2),\",\",ROUNDDOWN(C26,0),\".\",RIGHT(TEXT(C26*100,0),2),\",\",ROUNDDOWN(D26,0),\".\",RIGHT(TEXT(D26*100,0),2))","v":{"$error":"#VALUE!"}},{"$f":"CONCATENATE(ROUNDDOWN(B26+0.5,0),\".\",RIGHT(TEXT((B26+0.5)*100,0),2),\",\",ROUNDDOWN(C26+0.5,0),\".\",RIGHT(TEXT((C26+0.5)*100,0),2),\",\",ROUNDDOWN(D26,0),\".\",RIGHT(TEXT(D26*100,0),2))","v":{"$error":"#VALUE!"}},{"$f":"CONCATENATE(ROUNDDOWN(B26+0.5,0),\".\",RIGHT(TEXT((B26+0.5)*100,0),2),\",\",ROUNDDOWN(C26-0.5,0),\".\",RIGHT(TEXT((C26-0.5)*100,0),2),\",\",ROUNDDOWN(D26,0),\".\",RIGHT(TEXT(D26*100,0),2))","v":{"$error":"#VALUE!"}}]
[{"$f":"IF(Saisie!F35=\"\",\"\",Saisie!B35)","v":""},{"$f":"IF(Saisie!L35=\"\",\"\",Saisie!L35)","v":""},{"$f":"Saisie!M35","v":""},{"$f":"Saisie!N35","v":""},null,{"$error":"#VALUE!"},{"$error":"#VALUE!"},{"$error":"#VALUE!"}]
[{"$f":"IF(Saisie!F36=\"\",\"\",Saisie!B36)","v":""},{"$f":"IF(Saisie!L36=\"\",\"\",Saisie!L36)","v":""},{"$f":"Saisie!M36","v":""},{"$f":"Saisie!N36","v":""},null,{"$error":"#VALUE!"},{"$error":"#VALUE!"},{"$error":"#VALUE!"}]
[{"$f":"IF(Saisie!F37=\"\",\"\",Saisie!B37)","v":""},{"$f":"IF(Saisie!L37=\"\",\"\",Saisie!L37)","v":""},{"$f":"Saisie!M37","v":""},{"$f":"Saisie!N37","v":""},null,{"$error":"#VALUE!"},{"$error":"#VALUE!"},{"$error":"#VALUE!"}]
[{"$f":"IF(Saisie!F38=\"\",\"\",Saisie!B38)","v":""},{"$f":"IF(Saisie!L38=\"\",\"\",Saisie!L38)","v":""},{"$f":"Saisie!M38","v":""},{"$f":"Saisie!N38","v":""},null,{"$error":"#VALUE!"},{"$error":"#VALUE!"},{"$error":"#VALUE!"}]
[{"$f":"IF(Saisie!F39=\"\",\"\",Saisie!B39)","v":""},{"$f":"IF(Saisie!L39=\"\",\"\",Saisie!L39)","v":""},{"$f":"Saisie!M39","v":""},{"$f":"Saisie!N39","v":""},null,{"$error":"#VALUE!"},{"$error":"#VALUE!"},{"$error":"#VALUE!"}]
[{"$f":"IF(Saisie!F40=\"\",\"\",Saisie!B40)","v":""},{"$f":"IF(Saisie!L40=\"\",\"\",Saisie!L40)","v":""},{"$f":"Saisie!M40","v":""},{"$f":"Saisie!N40","v":""},null,{"$error":"#VALUE!"},{"$error":"#VALUE!"},{"$error":"#VALUE!"}]
[{"$f":"IF(Saisie!F41=\"\",\"\",Saisie!B41)","v":""},{"$f":"IF(Saisie!L41=\"\",\"\",Saisie!L41)","v":""},{"$f":"Saisie!M41","v":""},{"$f":"Saisie!N41","v":""},null,{"$error":"#VALUE!"},{"$error":"#VALUE!"},{"$error":"#VALUE!"}]
[{"$f":"IF(Saisie!F42=\"\",\"\",Saisie!B42)","v":""},{"$f":"IF(Saisie!L42=\"\",\"\",Saisie!L42)","v":""},{"$f":"Saisie!M42","v":""},{"$f":"Saisie!N42","v":""},null,{"$error":"#VALUE!"},{"$error":"#VALUE!"},{"$error":"#VALUE!"}]
[{"$f":"IF(Saisie!F43=\"\",\"\",Saisie!B43)","v":""},{"$f":"IF(Saisie!L43=\"\",\"\",Saisie!L43)","v":""},{"$f":"Saisie!M43","v":""},{"$f":"Saisie!N43","v":""},null,{"$error":"#VALUE!"},{"$error":"#VALUE!"},{"$error":"#VALUE!"}]
[{"$f":"IF(Saisie!F44=\"\",\"\",Saisie!B44)","v":""},{"$f":"IF(Saisie!L44=\"\",\"\",Saisie!L44)","v":""},{"$f":"Saisie!M44","v":""},{"$f":"Saisie!N44","v":""},null,{"$error":"#VALUE!"},{"$error":"#VALUE!"},{"$error":"#VALUE!"}]
[{"$f":"IF(Saisie!F45=\"\",\"\",Saisie!B45)","v":""},{"$f":"IF(Saisie!L45=\"\",\"\",Saisie!L45)","v":""},{"$f":"Saisie!M45","v":""},{"$f":"Saisie!N45","v":""},null,{"$error":"#VALUE!"},{"$error":"#VALUE!"},{"$error":"#VALUE!"}]
[{"$f":"IF(Saisie!F46=\"\",\"\",Saisie!B46)","v":""},{"$f":"IF(Saisie!L46=\"\",\"\",Saisie!L46)","v":""},{"$f":"Saisie!M46","v":""},{"$f":"Saisie!N46","v":""},null,{"$error":"#VALUE!"},{"$error":"#VALUE!"},{"$error":"#VALUE!"}]
[{"$f":"IF(Saisie!F47=\"\",\"\",Saisie!B47)","v":""},{"$f":"IF(Saisie!L47=\"\",\"\",Saisie!L47)","v":""},{"$f":"Saisie!M47","v":""},{"$f":"Saisie!N47","v":""},null,{"$error":"#VALUE!"},{"$error":"#VALUE!"},{"$error":"#VALUE!"}]
[{"$f":"IF(Saisie!F48=\"\",\"\",Saisie!B48)","v":""},{"$f":"IF(Saisie!L48=\"\",\"\",Saisie!L48)","v":""},{"$f":"Saisie!M48","v":""},{"$f":"Saisie!N48","v":""},null,{"$error":"#VALUE!"},{"$error":"#VALUE!"},{"$error":"#VALUE!"}]
[{"$f":"IF(Saisie!F49=\"\",\"\",Saisie!B49)","v":""},{"$f":"IF(Saisie!L49=\"\",\"\",Saisie!L49)","v":""},{"$f":"Saisie!M49","v":""},{"$f":"Saisie!N49","v":""},null,{"$error":"#VALUE!"},{"$error":"#VALUE!"},{"$error":"#VALUE!"}]
[{"$f":"IF(Saisie!F50=\"\",\"\",Saisie!B50)","v":""},{"$f":"IF(Saisie!L50=\"\",\"\",Saisie!L50)","v":""},{"$f":"Saisie!M50","v":""},{"$f":"Saisie!N50","v":""},null,{"$error":"#VALUE!"},{"$error":"#VALUE!"},{"$error":"#VALUE!"}]
[{"$f":"IF(Saisie!F51=\"\",\"\",Saisie!B51)","v":""},{"$f":"IF(Saisie!L51=\"\",\"\",Saisie!L51)","v":""},{"$f":"Saisie!M51","v":""},{"$f":"Saisie!N51","v":""},null,{"$error":"#VALUE!"},{"$error":"#VALUE!"},{"$error":"#VALUE!"}]
[{"$f":"IF(Saisie!F52=\"\",\"\",Saisie!B52)","v":""},{"$f":"IF(Saisie!L52=\"\",\"\",Saisie!L52)","v":""},{"$f":"Saisie!M52","v":""},{"$f":"Saisie!N52","v":""},null,{"$error":"#VALUE!"},{"$error":"#VALUE!"},{"$error":"#VALUE!"}]
[{"$f":"IF(Saisie!F53=\"\",\"\",Saisie!B53)","v":""},{"$f":"IF(Saisie!L53=\"\",\"\",Saisie!L53)","v":""},{"$f":"Saisie!M53","v":""},{"$f":"Saisie!N53","v":""},null,{"$error":"#VALUE!"},{"$error":"#VALUE!"},{"$error":"#VALUE!"}]
[{"$f":"IF(Saisie!F54=\"\",\"\",Saisie!B54)","v":""},{"$f":"IF(Saisie!L54=\"\",\"\",Saisie!L54)","v":""},{"$f":"Saisie!M54","v":""},{"$f":"Saisie!N54","v":""},null,{"$error":"#VALUE!"},{"$error":"#VALUE!"},{"$error":"#VALUE!"}]
[{"$f":"IF(Saisie!F55=\"\",\"\",Saisie!B55)","v":""},{"$f":"IF(Saisie!L55=\"\",\"\",Saisie!L55)","v":""},{"$f":"Saisie!M55","v":""},{"$f":"Saisie!N55","v":""},null,{"$error":"#VALUE!"},{"$error":"#VALUE!"},{"$error":"#VALUE!"}]
[{"$f":"IF(Saisie!F56=\"\",\"\",Saisie!B56)","v":""},{"$f":"IF(Saisie!L56=\"\",\"\",Saisie!L56)","v":""},{"$f":"Saisie!M56","v":""},{"$f":"Saisie!N56","v":""},null,{"$error":"#VALUE!"},{"$error":"#VALUE!"},{"$error":"#VALUE!"}]
[{"$f":"IF(Saisie!F57=\"\",\"\",Saisie!B57)","v":""},{"$f":"IF(Saisie!L57=\"\",\"\",Saisie!L57)","v":""},{"$f":"Saisie!M57","v":""},{"$f":"Saisie!N57","v":""},null,{"$error":"#VALUE!"},{"$error":"#VALUE!"},{"$error":"#VALUE!"}]
[{"$f":"IF(Saisie!F58=\"\",\"\",Saisie!B58)","v":""},{"$f":"IF(Saisie!L58=\"\",\"\",Saisie!L58)","v":""},{"$f":"Saisie!M58","v":""},{"$f":"Saisie!N58","v":""},null,{"$error":"#VALUE!"},{"$error":"#VALUE!"},{"$error":"#VALUE!"}]
[{"$f":"IF(Saisie!F59=\"\",\"\",Saisie!B59)","v":""},{"$f":"IF(Saisie!L59=\"\",\"\",Saisie!L59)","v":""},{"$f":"Saisie!M59","v":""},{"$f":"Saisie!N59","v":""},null,{"$error":"#VALUE!"},{"$error":"#VALUE!"},{"$error":"#VALUE!"}]
[{"$f":"IF(Saisie!F60=\"\",\"\",Saisie!B60)","v":22222},{"$f":"IF(Saisie!L60=\"\",\"\",Saisie!L60)","v":2502087.972114834},{"$f":"Saisie!M60","v":1201125.8228630403},{"$f":"Saisie!N60","v":400.45150000000001},null,"2502087.97,1201125.82,400.45","2502088.47,1201126.32,400.45","2502088.47,1201125.32,400.45"]

{"sheet":"Autocad_Pts","index":2,"n_rows":59,"n_cols":4,"rows_kept":59,"cut":false,"hidden":false,"merged":[]}
["-calque E HEPIA_POINTS ","crée le calque HEPIA_POINT et le rend actif",null,"Utilisation"]
["-calque CO 140 HEPIA_POINTS ","change la couleur du calque à 140"]
["pdmode 3","affiche des croix comme symbole de points"]
["pdsize 0.5","dimensionne les symboles de points à 0.5m"]
[{"$f":"IF(Resultat!A2=\"\",\"\",CONCATENATE(\"POINT \",Resultat!F2))","v":"POINT 2502100.00,1201080.00,400.00"},"insère les points"]
[{"$f":"IF(Resultat!A3=\"\",\"\",CONCATENATE(\"POINT \",Resultat!F3))","v":"POINT 2502108.80,1201078.38,400.05"},null,null,"Cette feuille vous permet d'injecter les  points  dans votre dessin autocad sur le calque POINTS"]
[{"$f":"IF(Resultat!A4=\"\",\"\",CONCATENATE(\"POINT \",Resultat!F4))","v":"POINT 2502123.70,1201067.75,400.71"},null,null," dans votre dessin autocad sur le calque NoPTS"]
[{"$f":"IF(Resultat!A5=\"\",\"\",CONCATENATE(\"POINT \",Resultat!F5))","v":"POINT 2502119.02,1201069.35,400.65"}]
[{"$f":"IF(Resultat!A6=\"\",\"\",CONCATENATE(\"POINT \",Resultat!F6))","v":"POINT 2502110.13,1201072.35,400.44"}]
[{"$f":"IF(Resultat!A7=\"\",\"\",CONCATENATE(\"POINT \",Resultat!F7))","v":"POINT 2502105.76,1201073.57,400.47"},null,null,"Pour pouvoir injecter ce résultat dans Autocad, il faut copier les "]
[{"$f":"IF(Resultat!A8=\"\",\"\",CONCATENATE(\"POINT \",Resultat!F8))","v":"POINT 2502100.15,1201075.09,400.38"},null,null,"cellules A1 à AN-1, par exemple, dans un bloc note"]
[{"$f":"IF(Resultat!A9=\"\",\"\",CONCATENATE(\"POINT \",Resultat!F9))","v":"POINT 2502095.38,1201076.66,400.35"},null,null,"puis enregistrer le fichier avec une extension .scr "]
[{"$f":"IF(Resultat!A10=\"\",\"\",CONCATENATE(\"POINT \",Resultat!F10))","v":"POINT 2502090.87,1201077.99,400.35"},null,null,"Exemple: Fichier / Enregister sous / A1_Points.scr"]
[{"$f":"IF(Resultat!A11=\"\",\"\",CONCATENATE(\"POINT \",Resultat!F11))","v":"POINT 2502087.35,1201079.14,400.34"}]
[{"$f":"IF(Resultat!A12=\"\",\"\",CONCATENATE(\"POINT \",Resultat!F12))","v":"POINT 2502089.14,1201079.62,400.18"}]
[{"$f":"IF(Resultat!A13=\"\",\"\",CONCATENATE(\"POINT \",Resultat!F13))","v":"POINT 2502091.84,1201087.68,399.67"},null,null,"Dans Autocad, "]
[{"$f":"IF(Resultat!A14=\"\",\"\",CONCATENATE(\"POINT \",Resultat!F14))","v":"POINT 2502107.86,1201074.42,400.30"},null,null,"aller dans le menu \"Gérer\" et cliquer sur \"Script\""]
[{"$f":"IF(Resultat!A15=\"\",\"\",CONCATENATE(\"POINT \",Resultat!F15))","v":"POINT 2502085.91,1201082.54,399.85"},null,null,"Allez chercher vos fichiers et voila…."]
[{"$f":"IF(Resultat!A16=\"\",\"\",CONCATENATE(\"POINT \",Resultat!F16))","v":"POINT 2502086.64,1201086.83,399.64"},null,null,"Si vos point sont invisible double clic molette"]
[{"$f":"IF(Resultat!A17=\"\",\"\",CONCATENATE(\"POINT \",Resultat!F17))","v":"POINT 2502087.68,1201089.56,399.60"},null,null,"Si vos point sont minuscules \"Début\" \"Utilitaire\","]
[{"$f":"IF(Resultat!A18=\"\",\"\",CONCATENATE(\"POINT \",Resultat!F18))","v":"POINT 2502111.06,1201079.44,399.98"},null,null,"Style de point et modifier la taille 2.5 et la forme +"]
[{"$f":"IF(Resultat!A19=\"\",\"\",CONCATENATE(\"POINT \",Resultat!F19))","v":"POINT 2502104.67,1201089.43,399.44"}]
[{"$f":"IF(Resultat!A20=\"\",\"\",CONCATENATE(\"POINT \",Resultat!F20))","v":"POINT 2502099.09,1201091.47,399.38"}]
[{"$f":"IF(Resultat!A21=\"\",\"\",CONCATENATE(\"POINT \",Resultat!F21))","v":"POINT 2502127.26,1201077.99,400.57"}]
[{"$f":"IF(Resultat!A22=\"\",\"\",CONCATENATE(\"POINT \",Resultat!F22))","v":""}]
[{"$f":"IF(Resultat!A23=\"\",\"\",CONCATENATE(\"POINT \",Resultat!F23))","v":""}]
[{"$f":"IF(Resultat!A24=\"\",\"\",CONCATENATE(\"POINT \",Resultat!F24))","v":""}]
[{"$f":"IF(Resultat!A25=\"\",\"\",CONCATENATE(\"POINT \",Resultat!F25))","v":""}]
[{"$f":"IF(Resultat!A26=\"\",\"\",CONCATENATE(\"POINT \",Resultat!F26))","v":""}]
[{"$f":"IF(Resultat!A27=\"\",\"\",CONCATENATE(\"POINT \",Resultat!F27))","v":""}]
[{"$f":"IF(Resultat!A28=\"\",\"\",CONCATENATE(\"POINT \",Resultat!F28))","v":""}]
[{"$f":"IF(Resultat!A29=\"\",\"\",CONCATENATE(\"POINT \",Resultat!F29))","v":""}]
[{"$f":"IF(Resultat!A30=\"\",\"\",CONCATENATE(\"POINT \",Resultat!F30))","v":""}]
[{"$f":"IF(Resultat!A31=\"\",\"\",CONCATENATE(\"POINT \",Resultat!F31))","v":""}]
[{"$f":"IF(Resultat!A32=\"\",\"\",CONCATENATE(\"POINT \",Resultat!F32))","v":""}]
[{"$f":"IF(Resultat!A33=\"\",\"\",CONCATENATE(\"POINT \",Resultat!F33))","v":""}]
[{"$f":"IF(Resultat!A34=\"\",\"\",CONCATENATE(\"POINT \",Resultat!F34))","v":""}]
[{"$f":"IF(Resultat!A35=\"\",\"\",CONCATENATE(\"POINT \",Resultat!F35))","v":""}]
[{"$f":"IF(Resultat!A36=\"\",\"\",CONCATENATE(\"POINT \",Resultat!F36))","v":""}]
[{"$f":"IF(Resultat!A37=\"\",\"\",CONCATENATE(\"POINT \",Resultat!F37))","v":""}]
[{"$f":"IF(Resultat!A38=\"\",\"\",CONCATENATE(\"POINT \",Resultat!F38))","v":""}]
[{"$f":"IF(Resultat!A39=\"\",\"\",CONCATENATE(\"POINT \",Resultat!F39))","v":""}]
[{"$f":"IF(Resultat!A40=\"\",\"\",CONCATENATE(\"POINT \",Resultat!F40))","v":""}]
[{"$f":"IF(Resultat!A41=\"\",\"\",CONCATENATE(\"POINT \",Resultat!F41))","v":""}]
[{"$f":"IF(Resultat!A42=\"\",\"\",CONCATENATE(\"POINT \",Resultat!F42))","v":""}]
[{"$f":"IF(Resultat!A43=\"\",\"\",CONCATENATE(\"POINT \",Resultat!F43))","v":""}]
[{"$f":"IF(Resultat!A44=\"\",\"\",CONCATENATE(\"POINT \",Resultat!F44))","v":""}]
[{"$f":"IF(Resultat!A45=\"\",\"\",CONCATENATE(\"POINT \",Resultat!F45))","v":""}]
[{"$f":"IF(Resultat!A46=\"\",\"\",CONCATENATE(\"POINT \",Resultat!F46))","v":""}]
[{"$f":"IF(Resultat!A47=\"\",\"\",CONCATENATE(\"POINT \",Resultat!F47))","v":""}]
[{"$f":"IF(Resultat!A48=\"\",\"\",CONCATENATE(\"POINT \",Resultat!F48))","v":""}]
[{"$f":"IF(Resultat!A49=\"\",\"\",CONCATENATE(\"POINT \",Resultat!F49))","v":""}]
[{"$f":"IF(Resultat!A50=\"\",\"\",CONCATENATE(\"POINT \",Resultat!F50))","v":""}]
[{"$f":"IF(Resultat!A51=\"\",\"\",CONCATENATE(\"POINT \",Resultat!F51))","v":""}]
[{"$f":"IF(Resultat!A52=\"\",\"\",CONCATENATE(\"POINT \",Resultat!F52))","v":"POINT 2502087.97,1201125.82,400.45"}]
["-calque ch 0 ","rend le calque 0 actif"]
[null,"LAISSER CETTE LIGNE VIDE"]
["zoom et  ","effectue un zoom étendu"]
[null,"LAISSER CETTE LIGNE VIDE"]

{"sheet":"Autocad_Num","index":3,"n_rows":56,"n_cols":2,"rows_kept":56,"cut":false,"hidden":false,"merged":[]}
["-calque E HEPIA_NoPts ","crée le calque HEPIA_NoPts et le rend actif"]
["-calque CO 7 HEPIA_NoPts ","change la couleur du calque à 7 (blanc/noir)"]
["textstyle standard","rend le style de texte Standard actif"]
[{"$f":"IF(Resultat!A2=\"\",\"\",CONCATENATE(\"-TEXTE \",Resultat!G2,\" 0.5 0 \",Resultat!A2))","v":"-TEXTE 2502100.50,1201080.50,400.00 0.5 0 8031"}]
[{"$f":"IF(Resultat!A3=\"\",\"\",CONCATENATE(\"-TEXTE \",Resultat!G3,\" 0.5 0 \",Resultat!A3))","v":"-TEXTE 2502109.30,1201078.88,400.05 0.5 0 8062"}]
[{"$f":"IF(Resultat!A4=\"\",\"\",CONCATENATE(\"-TEXTE \",Resultat!G4,\" 0.5 0 \",Resultat!A4))","v":"-TEXTE 2502124.20,1201068.25,400.71 0.5 0 44"}]
[{"$f":"IF(Resultat!A5=\"\",\"\",CONCATENATE(\"-TEXTE \",Resultat!G5,\" 0.5 0 \",Resultat!A5))","v":"-TEXTE 2502119.52,1201069.85,400.65 0.5 0 45"}]
[{"$f":"IF(Resultat!A6=\"\",\"\",CONCATENATE(\"-TEXTE \",Resultat!G6,\" 0.5 0 \",Resultat!A6))","v":"-TEXTE 2502110.63,1201072.85,400.44 0.5 0 46"}]
[{"$f":"IF(Resultat!A7=\"\",\"\",CONCATENATE(\"-TEXTE \",Resultat!G7,\" 0.5 0 \",Resultat!A7))","v":"-TEXTE 2502106.26,1201074.07,400.47 0.5 0 47"}]
[{"$f":"IF(Resultat!A8=\"\",\"\",CONCATENATE(\"-TEXTE \",Resultat!G8,\" 0.5 0 \",Resultat!A8))","v":"-TEXTE 2502100.65,1201075.59,400.38 0.5 0 48"}]
[{"$f":"IF(Resultat!A9=\"\",\"\",CONCATENATE(\"-TEXTE \",Resultat!G9,\" 0.5 0 \",Resultat!A9))","v":"-TEXTE 2502095.88,1201077.16,400.35 0.5 0 49"}]
[{"$f":"IF(Resultat!A10=\"\",\"\",CONCATENATE(\"-TEXTE \",Resultat!G10,\" 0.5 0 \",Resultat!A10))","v":"-TEXTE 2502091.37,1201078.49,400.35 0.5 0 50"}]
[{"$f":"IF(Resultat!A11=\"\",\"\",CONCATENATE(\"-TEXTE \",Resultat!G11,\" 0.5 0 \",Resultat!A11))","v":"-TEXTE 2502087.85,1201079.64,400.34 0.5 0 51"}]
[{"$f":"IF(Resultat!A12=\"\",\"\",CONCATENATE(\"-TEXTE \",Resultat!G12,\" 0.5 0 \",Resultat!A12))","v":"-TEXTE 2502089.64,1201080.12,400.18 0.5 0 52"}]
[{"$f":"IF(Resultat!A13=\"\",\"\",CONCATENATE(\"-TEXTE \",Resultat!G13,\" 0.5 0 \",Resultat!A13))","v":"-TEXTE 2502092.34,1201088.18,399.67 0.5 0 53"}]
[{"$f":"IF(Resultat!A14=\"\",\"\",CONCATENATE(\"-TEXTE \",Resultat!G14,\" 0.5 0 \",Resultat!A14))","v":"-TEXTE 2502108.36,1201074.92,400.30 0.5 0 54"}]
[{"$f":"IF(Resultat!A15=\"\",\"\",CONCATENATE(\"-TEXTE \",Resultat!G15,\" 0.5 0 \",Resultat!A15))","v":"-TEXTE 2502086.41,1201083.04,399.85 0.5 0 55"}]
[{"$f":"IF(Resultat!A16=\"\",\"\",CONCATENATE(\"-TEXTE \",Resultat!G16,\" 0.5 0 \",Resultat!A16))","v":"-TEXTE 2502087.14,1201087.33,399.64 0.5 0 56"}]
[{"$f":"IF(Resultat!A17=\"\",\"\",CONCATENATE(\"-TEXTE \",Resultat!G17,\" 0.5 0 \",Resultat!A17))","v":"-TEXTE 2502088.18,1201090.06,399.60 0.5 0 57"}]
[{"$f":"IF(Resultat!A18=\"\",\"\",CONCATENATE(\"-TEXTE \",Resultat!G18,\" 0.5 0 \",Resultat!A18))","v":"-TEXTE 2502111.56,1201079.94,399.98 0.5 0 58"}]
[{"$f":"IF(Resultat!A19=\"\",\"\",CONCATENATE(\"-TEXTE \",Resultat!G19,\" 0.5 0 \",Resultat!A19))","v":"-TEXTE 2502105.17,1201089.93,399.44 0.5 0 59"}]
[{"$f":"IF(Resultat!A20=\"\",\"\",CONCATENATE(\"-TEXTE \",Resultat!G20,\" 0.5 0 \",Resultat!A20))","v":"-TEXTE 2502099.59,1201091.97,399.38 0.5 0 60"}]
[{"$f":"IF(Resultat!A21=\"\",\"\",CONCATENATE(\"-TEXTE \",Resultat!G21,\" 0.5 0 \",Resultat!A21))","v":"-TEXTE 2502127.76,1201078.49,400.57 0.5 0 61"}]
[{"$f":"IF(Resultat!A22=\"\",\"\",CONCATENATE(\"-TEXTE \",Resultat!G22,\" 0.5 0 \",Resultat!A22))","v":""}]
[{"$f":"IF(Resultat!A23=\"\",\"\",CONCATENATE(\"-TEXTE \",Resultat!G23,\" 0.5 0 \",Resultat!A23))","v":""}]
[{"$f":"IF(Resultat!A24=\"\",\"\",CONCATENATE(\"-TEXTE \",Resultat!G24,\" 0.5 0 \",Resultat!A24))","v":""}]
[{"$f":"IF(Resultat!A25=\"\",\"\",CONCATENATE(\"-TEXTE \",Resultat!G25,\" 0.5 0 \",Resultat!A25))","v":""}]
[{"$f":"IF(Resultat!A26=\"\",\"\",CONCATENATE(\"-TEXTE \",Resultat!G26,\" 0.5 0 \",Resultat!A26))","v":""}]
[{"$f":"IF(Resultat!A27=\"\",\"\",CONCATENATE(\"-TEXTE \",Resultat!G27,\" 0.5 0 \",Resultat!A27))","v":""}]
[{"$f":"IF(Resultat!A28=\"\",\"\",CONCATENATE(\"-TEXTE \",Resultat!G28,\" 0.5 0 \",Resultat!A28))","v":""}]
[{"$f":"IF(Resultat!A29=\"\",\"\",CONCATENATE(\"-TEXTE \",Resultat!G29,\" 0.5 0 \",Resultat!A29))","v":""}]
[{"$f":"IF(Resultat!A30=\"\",\"\",CONCATENATE(\"-TEXTE \",Resultat!G30,\" 0.5 0 \",Resultat!A30))","v":""}]
[{"$f":"IF(Resultat!A31=\"\",\"\",CONCATENATE(\"-TEXTE \",Resultat!G31,\" 0.5 0 \",Resultat!A31))","v":""}]
[{"$f":"IF(Resultat!A32=\"\",\"\",CONCATENATE(\"-TEXTE \",Resultat!G32,\" 0.5 0 \",Resultat!A32))","v":""}]
[{"$f":"IF(Resultat!A33=\"\",\"\",CONCATENATE(\"-TEXTE \",Resultat!G33,\" 0.5 0 \",Resultat!A33))","v":""}]
[{"$f":"IF(Resultat!A34=\"\",\"\",CONCATENATE(\"-TEXTE \",Resultat!G34,\" 0.5 0 \",Resultat!A34))","v":""}]
[{"$f":"IF(Resultat!A35=\"\",\"\",CONCATENATE(\"-TEXTE \",Resultat!G35,\" 0.5 0 \",Resultat!A35))","v":""}]
[{"$f":"IF(Resultat!A36=\"\",\"\",CONCATENATE(\"-TEXTE \",Resultat!G36,\" 0.5 0 \",Resultat!A36))","v":""}]
[{"$f":"IF(Resultat!A37=\"\",\"\",CONCATENATE(\"-TEXTE \",Resultat!G37,\" 0.5 0 \",Resultat!A37))","v":""}]
[{"$f":"IF(Resultat!A38=\"\",\"\",CONCATENATE(\"-TEXTE \",Resultat!G38,\" 0.5 0 \",Resultat!A38))","v":""}]
[{"$f":"IF(Resultat!A39=\"\",\"\",CONCATENATE(\"-TEXTE \",Resultat!G39,\" 0.5 0 \",Resultat!A39))","v":""}]
[{"$f":"IF(Resultat!A40=\"\",\"\",CONCATENATE(\"-TEXTE \",Resultat!G40,\" 0.5 0 \",Resultat!A40))","v":""}]
[{"$f":"IF(Resultat!A41=\"\",\"\",CONCATENATE(\"-TEXTE \",Resultat!G41,\" 0.5 0 \",Resultat!A41))","v":""}]
[{"$f":"IF(Resultat!A42=\"\",\"\",CONCATENATE(\"-TEXTE \",Resultat!G42,\" 0.5 0 \",Resultat!A42))","v":""}]
[{"$f":"IF(Resultat!A43=\"\",\"\",CONCATENATE(\"-TEXTE \",Resultat!G43,\" 0.5 0 \",Resultat!A43))","v":""}]
[{"$f":"IF(Resultat!A44=\"\",\"\",CONCATENATE(\"-TEXTE \",Resultat!G44,\" 0.5 0 \",Resultat!A44))","v":""}]
[{"$f":"IF(Resultat!A45=\"\",\"\",CONCATENATE(\"-TEXTE \",Resultat!G45,\" 0.5 0 \",Resultat!A45))","v":""}]
[{"$f":"IF(Resultat!A46=\"\",\"\",CONCATENATE(\"-TEXTE \",Resultat!G46,\" 0.5 0 \",Resultat!A46))","v":""}]
[{"$f":"IF(Resultat!A47=\"\",\"\",CONCATENATE(\"-TEXTE \",Resultat!G47,\" 0.5 0 \",Resultat!A47))","v":""}]
[{"$f":"IF(Resultat!A48=\"\",\"\",CONCATENATE(\"-TEXTE \",Resultat!G48,\" 0.5 0 \",Resultat!A48))","v":""}]
[{"$f":"IF(Resultat!A49=\"\",\"\",CONCATENATE(\"-TEXTE \",Resultat!G49,\" 0.5 0 \",Resultat!A49))","v":""}]
[{"$f":"IF(Resultat!A50=\"\",\"\",CONCATENATE(\"-TEXTE \",Resultat!G50,\" 0.5 0 \",Resultat!A50))","v":""}]
[{"$f":"IF(Resultat!A51=\"\",\"\",CONCATENATE(\"-TEXTE \",Resultat!G51,\" 0.5 0 \",Resultat!A51))","v":""}]
[{"$f":"IF(Resultat!A52=\"\",\"\",CONCATENATE(\"-TEXTE \",Resultat!G52,\" 0.5 0 \",Resultat!A52))","v":"-TEXTE 2502088.47,1201126.32,400.45 0.5 0 22222"}]
["-calque ch 0","rend le calque 0 actif"]
[null,"LAISSER CETTE LIGNE VIDE"]

{"sheet":"Autocad_Txt_Altitude","index":4,"n_rows":56,"n_cols":2,"rows_kept":56,"cut":false,"hidden":false,"merged":[]}
["-calque E HEPIA_Altitudes ","crée le calque HEPIA_Altitudes et le rend actif"]
["-calque CO 7 HEPIA_Altitudes ","change la couleur du calque à 7 (blanc/noir)"]
["textstyle standard","rend le style de texte Standard actif"]
[{"$f":"IF(Resultat!A2=\"\",\"\",CONCATENATE(\"-TEXTE \",Resultat!H2,\" 0.5 0 \",TEXT(Resultat!D2,\"0.00\")))","v":"-TEXTE 2502100.50,1201079.50,400.00 0.5 0 400.00"}]
[{"$f":"IF(Resultat!A3=\"\",\"\",CONCATENATE(\"-TEXTE \",Resultat!H3,\" 0.5 0 \",TEXT(Resultat!D3,\"0.00\")))","v":"-TEXTE 2502109.30,1201077.88,400.05 0.5 0 400.05"}]
[{"$f":"IF(Resultat!A4=\"\",\"\",CONCATENATE(\"-TEXTE \",Resultat!H4,\" 0.5 0 \",TEXT(Resultat!D4,\"0.00\")))","v":"-TEXTE 2502124.20,1201067.25,400.71 0.5 0 400.71"}]
[{"$f":"IF(Resultat!A5=\"\",\"\",CONCATENATE(\"-TEXTE \",Resultat!H5,\" 0.5 0 \",TEXT(Resultat!D5,\"0.00\")))","v":"-TEXTE 2502119.52,1201068.85,400.65 0.5 0 400.65"}]
[{"$f":"IF(Resultat!A6=\"\",\"\",CONCATENATE(\"-TEXTE \",Resultat!H6,\" 0.5 0 \",TEXT(Resultat!D6,\"0.00\")))","v":"-TEXTE 2502110.63,1201071.85,400.44 0.5 0 400.44"}]
[{"$f":"IF(Resultat!A7=\"\",\"\",CONCATENATE(\"-TEXTE \",Resultat!H7,\" 0.5 0 \",TEXT(Resultat!D7,\"0.00\")))","v":"-TEXTE 2502106.26,1201073.07,400.47 0.5 0 400.47"}]
[{"$f":"IF(Resultat!A8=\"\",\"\",CONCATENATE(\"-TEXTE \",Resultat!H8,\" 0.5 0 \",TEXT(Resultat!D8,\"0.00\")))","v":"-TEXTE 2502100.65,1201074.59,400.38 0.5 0 400.38"}]
[{"$f":"IF(Resultat!A9=\"\",\"\",CONCATENATE(\"-TEXTE \",Resultat!H9,\" 0.5 0 \",TEXT(Resultat!D9,\"0.00\")))","v":"-TEXTE 2502095.88,1201076.16,400.35 0.5 0 400.35"}]
[{"$f":"IF(Resultat!A10=\"\",\"\",CONCATENATE(\"-TEXTE \",Resultat!H10,\" 0.5 0 \",TEXT(Resultat!D10,\"0.00\")))","v":"-TEXTE 2502091.37,1201077.49,400.35 0.5 0 400.35"}]
[{"$f":"IF(Resultat!A11=\"\",\"\",CONCATENATE(\"-TEXTE \",Resultat!H11,\" 0.5 0 \",TEXT(Resultat!D11,\"0.00\")))","v":"-TEXTE 2502087.85,1201078.64,400.34 0.5 0 400.34"}]
[{"$f":"IF(Resultat!A12=\"\",\"\",CONCATENATE(\"-TEXTE \",Resultat!H12,\" 0.5 0 \",TEXT(Resultat!D12,\"0.00\")))","v":"-TEXTE 2502089.64,1201079.12,400.18 0.5 0 400.18"}]
[{"$f":"IF(Resultat!A13=\"\",\"\",CONCATENATE(\"-TEXTE \",Resultat!H13,\" 0.5 0 \",TEXT(Resultat!D13,\"0.00\")))","v":"-TEXTE 2502092.34,1201087.18,399.67 0.5 0 399.67"}]
[{"$f":"IF(Resultat!A14=\"\",\"\",CONCATENATE(\"-TEXTE \",Resultat!H14,\" 0.5 0 \",TEXT(Resultat!D14,\"0.00\")))","v":"-TEXTE 2502108.36,1201073.92,400.30 0.5 0 400.30"}]
[{"$f":"IF(Resultat!A15=\"\",\"\",CONCATENATE(\"-TEXTE \",Resultat!H15,\" 0.5 0 \",TEXT(Resultat!D15,\"0.00\")))","v":"-TEXTE 2502086.41,1201082.04,399.85 0.5 0 399.85"}]
[{"$f":"IF(Resultat!A16=\"\",\"\",CONCATENATE(\"-TEXTE \",Resultat!H16,\" 0.5 0 \",TEXT(Resultat!D16,\"0.00\")))","v":"-TEXTE 2502087.14,1201086.33,399.64 0.5 0 399.64"}]
[{"$f":"IF(Resultat!A17=\"\",\"\",CONCATENATE(\"-TEXTE \",Resultat!H17,\" 0.5 0 \",TEXT(Resultat!D17,\"0.00\")))","v":"-TEXTE 2502088.18,1201089.06,399.60 0.5 0 399.60"}]
[{"$f":"IF(Resultat!A18=\"\",\"\",CONCATENATE(\"-TEXTE \",Resultat!H18,\" 0.5 0 \",TEXT(Resultat!D18,\"0.00\")))","v":"-TEXTE 2502111.56,1201078.94,399.98 0.5 0 399.98"}]
[{"$f":"IF(Resultat!A19=\"\",\"\",CONCATENATE(\"-TEXTE \",Resultat!H19,\" 0.5 0 \",TEXT(Resultat!D19,\"0.00\")))","v":"-TEXTE 2502105.17,1201088.93,399.44 0.5 0 399.44"}]
[{"$f":"IF(Resultat!A20=\"\",\"\",CONCATENATE(\"-TEXTE \",Resultat!H20,\" 0.5 0 \",TEXT(Resultat!D20,\"0.00\")))","v":"-TEXTE 2502099.59,1201090.97,399.38 0.5 0 399.38"}]
[{"$f":"IF(Resultat!A21=\"\",\"\",CONCATENATE(\"-TEXTE \",Resultat!H21,\" 0.5 0 \",TEXT(Resultat!D21,\"0.00\")))","v":"-TEXTE 2502127.76,1201077.49,400.57 0.5 0 400.57"}]
[{"$f":"IF(Resultat!A22=\"\",\"\",CONCATENATE(\"-TEXTE \",Resultat!H22,\" 0.5 0 \",TEXT(Resultat!D22,\"0.00\")))","v":""}]
[{"$f":"IF(Resultat!A23=\"\",\"\",CONCATENATE(\"-TEXTE \",Resultat!H23,\" 0.5 0 \",TEXT(Resultat!D23,\"0.00\")))","v":""}]
[{"$f":"IF(Resultat!A24=\"\",\"\",CONCATENATE(\"-TEXTE \",Resultat!H24,\" 0.5 0 \",TEXT(Resultat!D24,\"0.00\")))","v":""}]
[{"$f":"IF(Resultat!A25=\"\",\"\",CONCATENATE(\"-TEXTE \",Resultat!H25,\" 0.5 0 \",TEXT(Resultat!D25,\"0.00\")))","v":""}]
[{"$f":"IF(Resultat!A26=\"\",\"\",CONCATENATE(\"-TEXTE \",Resultat!H26,\" 0.5 0 \",TEXT(Resultat!D26,\"0.00\")))","v":""}]
[{"$f":"IF(Resultat!A27=\"\",\"\",CONCATENATE(\"-TEXTE \",Resultat!H27,\" 0.5 0 \",TEXT(Resultat!D27,\"0.00\")))","v":""}]
[{"$f":"IF(Resultat!A28=\"\",\"\",CONCATENATE(\"-TEXTE \",Resultat!H28,\" 0.5 0 \",TEXT(Resultat!D28,\"0.00\")))","v":""}]
[{"$f":"IF(Resultat!A29=\"\",\"\",CONCATENATE(\"-TEXTE \",Resultat!H29,\" 0.5 0 \",TEXT(Resultat!D29,\"0.00\")))","v":""}]
[{"$f":"IF(Resultat!A30=\"\",\"\",CONCATENATE(\"-TEXTE \",Resultat!H30,\" 0.5 0 \",TEXT(Resultat!D30,\"0.00\")))","v":""}]
[{"$f":"IF(Resultat!A31=\"\",\"\",CONCATENATE(\"-TEXTE \",Resultat!H31,\" 0.5 0 \",TEXT(Resultat!D31,\"0.00\")))","v":""}]
[{"$f":"IF(Resultat!A32=\"\",\"\",CONCATENATE(\"-TEXTE \",Resultat!H32,\" 0.5 0 \",TEXT(Resultat!D32,\"0.00\")))","v":""}]
[{"$f":"IF(Resultat!A33=\"\",\"\",CONCATENATE(\"-TEXTE \",Resultat!H33,\" 0.5 0 \",TEXT(Resultat!D33,\"0.00\")))","v":""}]
[{"$f":"IF(Resultat!A34=\"\",\"\",CONCATENATE(\"-TEXTE \",Resultat!H34,\" 0.5 0 \",TEXT(Resultat!D34,\"0.00\")))","v":""}]
[{"$f":"IF(Resultat!A35=\"\",\"\",CONCATENATE(\"-TEXTE \",Resultat!H35,\" 0.5 0 \",TEXT(Resultat!D35,\"0.00\")))","v":""}]
[{"$f":"IF(Resultat!A36=\"\",\"\",CONCATENATE(\"-TEXTE \",Resultat!H36,\" 0.5 0 \",TEXT(Resultat!D36,\"0.00\")))","v":""}]
[{"$f":"IF(Resultat!A37=\"\",\"\",CONCATENATE(\"-TEXTE \",Resultat!H37,\" 0.5 0 \",TEXT(Resultat!D37,\"0.00\")))","v":""}]
[{"$f":"IF(Resultat!A38=\"\",\"\",CONCATENATE(\"-TEXTE \",Resultat!H38,\" 0.5 0 \",TEXT(Resultat!D38,\"0.00\")))","v":""}]
[{"$f":"IF(Resultat!A39=\"\",\"\",CONCATENATE(\"-TEXTE \",Resultat!H39,\" 0.5 0 \",TEXT(Resultat!D39,\"0.00\")))","v":""}]
[{"$f":"IF(Resultat!A40=\"\",\"\",CONCATENATE(\"-TEXTE \",Resultat!H40,\" 0.5 0 \",TEXT(Resultat!D40,\"0.00\")))","v":""}]
[{"$f":"IF(Resultat!A41=\"\",\"\",CONCATENATE(\"-TEXTE \",Resultat!H41,\" 0.5 0 \",TEXT(Resultat!D41,\"0.00\")))","v":""}]
[{"$f":"IF(Resultat!A42=\"\",\"\",CONCATENATE(\"-TEXTE \",Resultat!H42,\" 0.5 0 \",TEXT(Resultat!D42,\"0.00\")))","v":""}]
[{"$f":"IF(Resultat!A43=\"\",\"\",CONCATENATE(\"-TEXTE \",Resultat!H43,\" 0.5 0 \",TEXT(Resultat!D43,\"0.00\")))","v":""}]
[{"$f":"IF(Resultat!A44=\"\",\"\",CONCATENATE(\"-TEXTE \",Resultat!H44,\" 0.5 0 \",TEXT(Resultat!D44,\"0.00\")))","v":""}]
[{"$f":"IF(Resultat!A45=\"\",\"\",CONCATENATE(\"-TEXTE \",Resultat!H45,\" 0.5 0 \",TEXT(Resultat!D45,\"0.00\")))","v":""}]
[{"$f":"IF(Resultat!A46=\"\",\"\",CONCATENATE(\"-TEXTE \",Resultat!H46,\" 0.5 0 \",TEXT(Resultat!D46,\"0.00\")))","v":""}]
[{"$f":"IF(Resultat!A47=\"\",\"\",CONCATENATE(\"-TEXTE \",Resultat!H47,\" 0.5 0 \",TEXT(Resultat!D47,\"0.00\")))","v":""}]
[{"$f":"IF(Resultat!A48=\"\",\"\",CONCATENATE(\"-TEXTE \",Resultat!H48,\" 0.5 0 \",TEXT(Resultat!D48,\"0.00\")))","v":""}]
[{"$f":"IF(Resultat!A49=\"\",\"\",CONCATENATE(\"-TEXTE \",Resultat!H49,\" 0.5 0 \",TEXT(Resultat!D49,\"0.00\")))","v":""}]
[{"$f":"IF(Resultat!A50=\"\",\"\",CONCATENATE(\"-TEXTE \",Resultat!H50,\" 0.5 0 \",TEXT(Resultat!D50,\"0.00\")))","v":""}]
[{"$f":"IF(Resultat!A51=\"\",\"\",CONCATENATE(\"-TEXTE \",Resultat!H51,\" 0.5 0 \",TEXT(Resultat!D51,\"0.00\")))","v":""}]
[{"$f":"IF(Resultat!A52=\"\",\"\",CONCATENATE(\"-TEXTE \",Resultat!H52,\" 0.5 0 \",TEXT(Resultat!D52,\"0.00\")))","v":"-TEXTE 2502088.47,1201125.32,400.45 0.5 0 400.45"}]
["-calque ch 0","rend le calque 0 actif"]
[null,"LAISSER CETTE LIGNE VIDE"]

{"sheet":"Script","index":5,"n_rows":169,"n_cols":4,"rows_kept":169,"cut":false,"hidden":false,"merged":[],"read":"row_number_cap"}
["données de base",null,null,"script"]
["-calque E HEPIA_Altitudes ","crée le calque HEPIA_Altitudes et le rend actif",null,"-calque E HEPIA_Altitudes "]
["-calque CO 7 HEPIA_Altitudes ","change la couleur du calque à 7 (blanc/noir)",null,"-calque CO 7 HEPIA_Altitudes "]
["textstyle standard","rend le style de texte Standard actif",null,"textstyle standard"]
[{"$f":"Autocad_Txt_Altitude!A4","v":"-TEXTE 2502100.50,1201079.50,400.00 0.5 0 400.00"},"insère les altitudes des points",null,"-TEXTE 2502100.50,1201079.50,400.00 0.5 0 400.00"]
[{"$f":"Autocad_Txt_Altitude!A5","v":"-TEXTE 2502109.30,1201077.88,400.05 0.5 0 400.05"},null,null,"-TEXTE 2502109.30,1201077.88,400.05 0.5 0 400.05"]
[{"$f":"Autocad_Txt_Altitude!A6","v":"-TEXTE 2502124.20,1201067.25,400.71 0.5 0 400.71"},null,null,"-TEXTE 2502124.20,1201067.25,400.71 0.5 0 400.71"]
[{"$f":"Autocad_Txt_Altitude!A7","v":"-TEXTE 2502119.52,1201068.85,400.65 0.5 0 400.65"},null,null,"-TEXTE 2502119.52,1201068.85,400.65 0.5 0 400.65"]
[{"$f":"Autocad_Txt_Altitude!A8","v":"-TEXTE 2502110.63,1201071.85,400.44 0.5 0 400.44"},null,null,"-TEXTE 2502110.63,1201071.85,400.44 0.5 0 400.44"]
[{"$f":"Autocad_Txt_Altitude!A9","v":"-TEXTE 2502106.26,1201073.07,400.47 0.5 0 400.47"},null,null,"-TEXTE 2502106.26,1201073.07,400.47 0.5 0 400.47"]
[{"$f":"Autocad_Txt_Altitude!A10","v":"-TEXTE 2502100.65,1201074.59,400.38 0.5 0 400.38"},null,null,"-TEXTE 2502100.65,1201074.59,400.38 0.5 0 400.38"]
[{"$f":"Autocad_Txt_Altitude!A11","v":"-TEXTE 2502095.88,1201076.16,400.35 0.5 0 400.35"},null,null,"-TEXTE 2502095.88,1201076.16,400.35 0.5 0 400.35"]
[{"$f":"Autocad_Txt_Altitude!A12","v":"-TEXTE 2502091.37,1201077.49,400.35 0.5 0 400.35"},null,null,"-TEXTE 2502091.37,1201077.49,400.35 0.5 0 400.35"]
[{"$f":"Autocad_Txt_Altitude!A13","v":"-TEXTE 2502087.85,1201078.64,400.34 0.5 0 400.34"},null,null,"-TEXTE 2502087.85,1201078.64,400.34 0.5 0 400.34"]
[{"$f":"Autocad_Txt_Altitude!A14","v":"-TEXTE 2502089.64,1201079.12,400.18 0.5 0 400.18"},null,null,"-TEXTE 2502089.64,1201079.12,400.18 0.5 0 400.18"]
[{"$f":"Autocad_Txt_Altitude!A15","v":"-TEXTE 2502092.34,1201087.18,399.67 0.5 0 399.67"},null,null,"-TEXTE 2502092.34,1201087.18,399.67 0.5 0 399.67"]
[{"$f":"Autocad_Txt_Altitude!A16","v":"-TEXTE 2502108.36,1201073.92,400.30 0.5 0 400.30"},null,null,"-TEXTE 2502108.36,1201073.92,400.30 0.5 0 400.30"]
[{"$f":"Autocad_Txt_Altitude!A17","v":"-TEXTE 2502086.41,1201082.04,399.85 0.5 0 399.85"},null,null,"-TEXTE 2502086.41,1201082.04,399.85 0.5 0 399.85"]
[{"$f":"Autocad_Txt_Altitude!A18","v":"-TEXTE 2502087.14,1201086.33,399.64 0.5 0 399.64"},null,null,"-TEXTE 2502087.14,1201086.33,399.64 0.5 0 399.64"]
[{"$f":"Autocad_Txt_Altitude!A19","v":"-TEXTE 2502088.18,1201089.06,399.60 0.5 0 399.60"},null,null,"-TEXTE 2502088.18,1201089.06,399.60 0.5 0 399.60"]
[{"$f":"Autocad_Txt_Altitude!A20","v":"-TEXTE 2502111.56,1201078.94,399.98 0.5 0 399.98"},null,null,"-TEXTE 2502111.56,1201078.94,399.98 0.5 0 399.98"]
[{"$f":"Autocad_Txt_Altitude!A21","v":"-TEXTE 2502105.17,1201088.93,399.44 0.5 0 399.44"},null,null,"-TEXTE 2502105.17,1201088.93,399.44 0.5 0 399.44"]
[{"$f":"Autocad_Txt_Altitude!A22","v":"-TEXTE 2502099.59,1201090.97,399.38 0.5 0 399.38"},null,null,"-TEXTE 2502099.59,1201090.97,399.38 0.5 0 399.38"]
[{"$f":"Autocad_Txt_Altitude!A23","v":"-TEXTE 2502127.76,1201077.49,400.57 0.5 0 400.57"},null,null,"-TEXTE 2502127.76,1201077.49,400.57 0.5 0 400.57"]
[{"$f":"Autocad_Txt_Altitude!A24","v":""},null,null,""]
[{"$f":"Autocad_Txt_Altitude!A25","v":""},null,null,""]
[{"$f":"Autocad_Txt_Altitude!A26","v":""},null,null,""]
[{"$f":"Autocad_Txt_Altitude!A27","v":""},null,null,""]
[{"$f":"Autocad_Txt_Altitude!A28","v":""},null,null,""]
[{"$f":"Autocad_Txt_Altitude!A29","v":""},null,null,""]
[{"$f":"Autocad_Txt_Altitude!A30","v":""},null,null,""]
[{"$f":"Autocad_Txt_Altitude!A31","v":""},null,null,""]
[{"$f":"Autocad_Txt_Altitude!A32","v":""},null,null,""]
[{"$f":"Autocad_Txt_Altitude!A33","v":""},null,null,""]
[{"$f":"Autocad_Txt_Altitude!A34","v":""},null,null,""]
[{"$f":"Autocad_Txt_Altitude!A35","v":""},null,null,""]
[{"$f":"Autocad_Txt_Altitude!A36","v":""},null,null,""]
[{"$f":"Autocad_Txt_Altitude!A37","v":""},null,null,""]
[{"$f":"Autocad_Txt_Altitude!A38","v":""},null,null,""]
[{"$f":"Autocad_Txt_Altitude!A39","v":""},null,null,""]
[{"$f":"Autocad_Txt_Altitude!A40","v":""},null,null,""]
[{"$f":"Autocad_Txt_Altitude!A41","v":""},null,null,""]
[{"$f":"Autocad_Txt_Altitude!A42","v":""},null,null,""]
[{"$f":"Autocad_Txt_Altitude!A43","v":""},null,null,""]
[{"$f":"Autocad_Txt_Altitude!A44","v":""},null,null,""]
[{"$f":"Autocad_Txt_Altitude!A45","v":""},null,null,""]
[{"$f":"Autocad_Txt_Altitude!A46","v":""},null,null,""]
[{"$f":"Autocad_Txt_Altitude!A47","v":""},null,null,""]
[{"$f":"Autocad_Txt_Altitude!A48","v":""},null,null,""]
[{"$f":"Autocad_Txt_Altitude!A49","v":""},null,null,""]
[{"$f":"Autocad_Txt_Altitude!A50","v":""},null,null,""]
[{"$f":"Autocad_Txt_Altitude!A51","v":""},null,null,""]
[{"$f":"Autocad_Txt_Altitude!A52","v":""},null,null,""]
[{"$f":"Autocad_Txt_Altitude!A53","v":""},null,null,""]
[{"$f":"Autocad_Txt_Altitude!A54","v":"-TEXTE 2502088.47,1201125.32,400.45 0.5 0 400.45"},null,null,"-TEXTE 2502088.47,1201125.32,400.45 0.5 0 400.45"]
["-calque ch 0 ","rend le calque 0 actif",null,"-calque ch 0 "]
["-calque E HEPIA_NoPts ","crée le calque HEPIA_NoPts et le rend actif",null,"-calque E HEPIA_NoPts "]
["-calque CO 7 HEPIA_NoPts ","change la couleur du calque à 7 (blanc/noir)",null,"-calque CO 7 HEPIA_NoPts "]
["textstyle standard","rend le style de texte Standard actif",null,"textstyle standard"]
[{"$f":"Autocad_Num!A4","v":"-TEXTE 2502100.50,1201080.50,400.00 0.5 0 8031"},"insère le numéros de points",null,"-TEXTE 2502100.50,1201080.50,400.00 0.5 0 8031"]
[{"$f":"Autocad_Num!A5","v":"-TEXTE 2502109.30,1201078.88,400.05 0.5 0 8062"},null,null,"-TEXTE 2502109.30,1201078.88,400.05 0.5 0 8062"]
[{"$f":"Autocad_Num!A6","v":"-TEXTE 2502124.20,1201068.25,400.71 0.5 0 44"},null,null,"-TEXTE 2502124.20,1201068.25,400.71 0.5 0 44"]
[{"$f":"Autocad_Num!A7","v":"-TEXTE 2502119.52,1201069.85,400.65 0.5 0 45"},null,null,"-TEXTE 2502119.52,1201069.85,400.65 0.5 0 45"]
[{"$f":"Autocad_Num!A8","v":"-TEXTE 2502110.63,1201072.85,400.44 0.5 0 46"},null,null,"-TEXTE 2502110.63,1201072.85,400.44 0.5 0 46"]
[{"$f":"Autocad_Num!A9","v":"-TEXTE 2502106.26,1201074.07,400.47 0.5 0 47"},null,null,"-TEXTE 2502106.26,1201074.07,400.47 0.5 0 47"]
[{"$f":"Autocad_Num!A10","v":"-TEXTE 2502100.65,1201075.59,400.38 0.5 0 48"},null,null,"-TEXTE 2502100.65,1201075.59,400.38 0.5 0 48"]
[{"$f":"Autocad_Num!A11","v":"-TEXTE 2502095.88,1201077.16,400.35 0.5 0 49"},null,null,"-TEXTE 2502095.88,1201077.16,400.35 0.5 0 49"]
[{"$f":"Autocad_Num!A12","v":"-TEXTE 2502091.37,1201078.49,400.35 0.5 0 50"},null,null,"-TEXTE 2502091.37,1201078.49,400.35 0.5 0 50"]
[{"$f":"Autocad_Num!A13","v":"-TEXTE 2502087.85,1201079.64,400.34 0.5 0 51"},null,null,"-TEXTE 2502087.85,1201079.64,400.34 0.5 0 51"]
[{"$f":"Autocad_Num!A14","v":"-TEXTE 2502089.64,1201080.12,400.18 0.5 0 52"},null,null,"-TEXTE 2502089.64,1201080.12,400.18 0.5 0 52"]
[{"$f":"Autocad_Num!A15","v":"-TEXTE 2502092.34,1201088.18,399.67 0.5 0 53"},null,null,"-TEXTE 2502092.34,1201088.18,399.67 0.5 0 53"]
[{"$f":"Autocad_Num!A16","v":"-TEXTE 2502108.36,1201074.92,400.30 0.5 0 54"},null,null,"-TEXTE 2502108.36,1201074.92,400.30 0.5 0 54"]
[{"$f":"Autocad_Num!A17","v":"-TEXTE 2502086.41,1201083.04,399.85 0.5 0 55"},null,null,"-TEXTE 2502086.41,1201083.04,399.85 0.5 0 55"]
[{"$f":"Autocad_Num!A18","v":"-TEXTE 2502087.14,1201087.33,399.64 0.5 0 56"},null,null,"-TEXTE 2502087.14,1201087.33,399.64 0.5 0 56"]
[{"$f":"Autocad_Num!A19","v":"-TEXTE 2502088.18,1201090.06,399.60 0.5 0 57"},null,null,"-TEXTE 2502088.18,1201090.06,399.60 0.5 0 57"]
[{"$f":"Autocad_Num!A20","v":"-TEXTE 2502111.56,1201079.94,399.98 0.5 0 58"},null,null,"-TEXTE 2502111.56,1201079.94,399.98 0.5 0 58"]
[{"$f":"Autocad_Num!A21","v":"-TEXTE 2502105.17,1201089.93,399.44 0.5 0 59"},null,null,"-TEXTE 2502105.17,1201089.93,399.44 0.5 0 59"]
[{"$f":"Autocad_Num!A22","v":"-TEXTE 2502099.59,1201091.97,399.38 0.5 0 60"},null,null,"-TEXTE 2502099.59,1201091.97,399.38 0.5 0 60"]
[{"$f":"Autocad_Num!A23","v":"-TEXTE 2502127.76,1201078.49,400.57 0.5 0 61"},null,null,"-TEXTE 2502127.76,1201078.49,400.57 0.5 0 61"]
[{"$f":"Autocad_Num!A24","v":""},null,null,""]
[{"$f":"Autocad_Num!A25","v":""},null,null,""]
[{"$f":"Autocad_Num!A26","v":""},null,null,""]
[{"$f":"Autocad_Num!A27","v":""},null,null,""]
[{"$f":"Autocad_Num!A28","v":""},null,null,""]
[{"$f":"Autocad_Num!A29","v":""},null,null,""]
[{"$f":"Autocad_Num!A30","v":""},null,null,""]
[{"$f":"Autocad_Num!A31","v":""},null,null,""]
[{"$f":"Autocad_Num!A32","v":""},null,null,""]
[{"$f":"Autocad_Num!A33","v":""},null,null,""]
[{"$f":"Autocad_Num!A34","v":""},null,null,""]
[{"$f":"Autocad_Num!A35","v":""},null,null,""]
[{"$f":"Autocad_Num!A36","v":""},null,null,""]
[{"$f":"Autocad_Num!A37","v":""},null,null,""]
[{"$f":"Autocad_Num!A38","v":""},null,null,""]
[{"$f":"Autocad_Num!A39","v":""},null,null,""]
[{"$f":"Autocad_Num!A40","v":""},null,null,""]
[{"$f":"Autocad_Num!A41","v":""},null,null,""]
[{"$f":"Autocad_Num!A42","v":""},null,null,""]
[{"$f":"Autocad_Num!A43","v":""},null,null,""]
[{"$f":"Autocad_Num!A44","v":""},null,null,""]
[{"$f":"Autocad_Num!A45","v":""},null,null,""]
[{"$f":"Autocad_Num!A46","v":""},null,null,""]
[{"$f":"Autocad_Num!A47","v":""},null,null,""]
[{"$f":"Autocad_Num!A48","v":""},null,null,""]
[{"$f":"Autocad_Num!A49","v":""},null,null,""]
[{"$f":"Autocad_Num!A50","v":""},null,null,""]
[{"$f":"Autocad_Num!A51","v":""},null,null,""]
[{"$f":"Autocad_Num!A52","v":""},null,null,""]
[{"$f":"Autocad_Num!A53","v":""},null,null,""]
[{"$f":"Autocad_Num!A54","v":"-TEXTE 2502088.47,1201126.32,400.45 0.5 0 22222"},null,null,"-TEXTE 2502088.47,1201126.32,400.45 0.5 0 22222"]
["-calque ch 0 ","rend le calque 0 actif",null,"-calque ch 0 "]
["-calque E HEPIA_POINTS ","crée le calque HEPIA_POINT et le rend actif",null,"-calque E HEPIA_POINTS "]
["-calque CO 140 HEPIA_POINTS ","change la couleur du calque à 140",null,"-calque CO 140 HEPIA_POINTS "]
["pdmode 3","affiche des croix comme symbole de points",null,"pdmode 3"]
["pdsize 0.5","dimensionne les symboles de points à 0.5m",null,"pdsize 0.5"]
[{"$f":"Autocad_Pts!A5","v":"POINT 2502100.00,1201080.00,400.00"},"insère les points",null,"POINT 2502100.00,1201080.00,400.00"]
[{"$f":"Autocad_Pts!A6","v":"POINT 2502108.80,1201078.38,400.05"},null,null,"POINT 2502108.80,1201078.38,400.05"]
[{"$f":"Autocad_Pts!A7","v":"POINT 2502123.70,1201067.75,400.71"},null,null,"POINT 2502123.70,1201067.75,400.71"]
[{"$f":"Autocad_Pts!A8","v":"POINT 2502119.02,1201069.35,400.65"},null,null,"POINT 2502119.02,1201069.35,400.65"]
[{"$f":"Autocad_Pts!A9","v":"POINT 2502110.13,1201072.35,400.44"},null,null,"POINT 2502110.13,1201072.35,400.44"]
[{"$f":"Autocad_Pts!A10","v":"POINT 2502105.76,1201073.57,400.47"},null,null,"POINT 2502105.76,1201073.57,400.47"]
[{"$f":"Autocad_Pts!A11","v":"POINT 2502100.15,1201075.09,400.38"},null,null,"POINT 2502100.15,1201075.09,400.38"]
[{"$f":"Autocad_Pts!A12","v":"POINT 2502095.38,1201076.66,400.35"},null,null,"POINT 2502095.38,1201076.66,400.35"]
[{"$f":"Autocad_Pts!A13","v":"POINT 2502090.87,1201077.99,400.35"},null,null,"POINT 2502090.87,1201077.99,400.35"]
[{"$f":"Autocad_Pts!A14","v":"POINT 2502087.35,1201079.14,400.34"},null,null,"POINT 2502087.35,1201079.14,400.34"]
[{"$f":"Autocad_Pts!A15","v":"POINT 2502089.14,1201079.62,400.18"},null,null,"POINT 2502089.14,1201079.62,400.18"]
[{"$f":"Autocad_Pts!A16","v":"POINT 2502091.84,1201087.68,399.67"},null,null,"POINT 2502091.84,1201087.68,399.67"]
[{"$f":"Autocad_Pts!A17","v":"POINT 2502107.86,1201074.42,400.30"},null,null,"POINT 2502107.86,1201074.42,400.30"]
[{"$f":"Autocad_Pts!A18","v":"POINT 2502085.91,1201082.54,399.85"},null,null,"POINT 2502085.91,1201082.54,399.85"]
[{"$f":"Autocad_Pts!A19","v":"POINT 2502086.64,1201086.83,399.64"},null,null,"POINT 2502086.64,1201086.83,399.64"]
[{"$f":"Autocad_Pts!A20","v":"POINT 2502087.68,1201089.56,399.60"},null,null,"POINT 2502087.68,1201089.56,399.60"]
[{"$f":"Autocad_Pts!A21","v":"POINT 2502111.06,1201079.44,399.98"},null,null,"POINT 2502111.06,1201079.44,399.98"]
[{"$f":"Autocad_Pts!A22","v":"POINT 2502104.67,1201089.43,399.44"},null,null,"POINT 2502104.67,1201089.43,399.44"]
[{"$f":"Autocad_Pts!A23","v":"POINT 2502099.09,1201091.47,399.38"},null,null,"POINT 2502099.09,1201091.47,399.38"]
[{"$f":"Autocad_Pts!A24","v":"POINT 2502127.26,1201077.99,400.57"},null,null,"POINT 2502127.26,1201077.99,400.57"]
[{"$f":"Autocad_Pts!A25","v":""},null,null,""]
[{"$f":"Autocad_Pts!A26","v":""},null,null,""]
[{"$f":"Autocad_Pts!A27","v":""},null,null,""]
[{"$f":"Autocad_Pts!A28","v":""},null,null,""]
[{"$f":"Autocad_Pts!A29","v":""},null,null,""]
[{"$f":"Autocad_Pts!A30","v":""},null,null,""]
[{"$f":"Autocad_Pts!A31","v":""},null,null,""]
[{"$f":"Autocad_Pts!A32","v":""},null,null,""]
[{"$f":"Autocad_Pts!A33","v":""},null,null,""]
[{"$f":"Autocad_Pts!A34","v":""},null,null,""]
[{"$f":"Autocad_Pts!A35","v":""},null,null,""]
[{"$f":"Autocad_Pts!A36","v":""},null,null,""]
[{"$f":"Autocad_Pts!A37","v":""},null,null,""]
[{"$f":"Autocad_Pts!A38","v":""},null,null,""]
[{"$f":"Autocad_Pts!A39","v":""},null,null,""]
[{"$f":"Autocad_Pts!A40","v":""},null,null,""]
[{"$f":"Autocad_Pts!A41","v":""},null,null,""]
[{"$f":"Autocad_Pts!A42","v":""},null,null,""]
[{"$f":"Autocad_Pts!A43","v":""},null,null,""]
[{"$f":"Autocad_Pts!A44","v":""},null,null,""]
[{"$f":"Autocad_Pts!A45","v":""},null,null,""]
[{"$f":"Autocad_Pts!A46","v":""},null,null,""]
[{"$f":"Autocad_Pts!A47","v":""},null,null,""]
[{"$f":"Autocad_Pts!A48","v":""},null,null,""]
[{"$f":"Autocad_Pts!A49","v":""},null,null,""]
[{"$f":"Autocad_Pts!A50","v":""},null,null,""]
[{"$f":"Autocad_Pts!A51","v":""},null,null,""]
[{"$f":"Autocad_Pts!A52","v":""},null,null,""]
[{"$f":"Autocad_Pts!A53","v":""},null,null,""]
[{"$f":"Autocad_Pts!A54","v":""},null,null,""]
[{"$f":"Autocad_Pts!A55","v":"POINT 2502087.97,1201125.82,400.45"},null,null,"POINT 2502087.97,1201125.82,400.45"]
["-calque ch 0 ","rend le calque 0 actif",null,"-calque ch 0 "]
["zoom et ","effectue un zoom étendu",null,"zoom et "]
[null,"LAISSER CETTE LIGNE VIDE"]

{"sheet":"Protocole de terrain vierge (2)","index":6,"n_rows":50,"n_cols":9,"rows_kept":50,"cut":false,"hidden":false,"merged":[[8,8,8,9]]}
[null,null,"Relevé des points  au niveau, en station libre vers deux points connus."]
[]
[null,"Affaire:",null,null,"Opérateurs"]
[]
[null,"Date",null,null,"Instrument"]
[null,null,"Choisir: Deg / Grad"]
[null,"Unité"]
[]
["Li","Numéro","Direction","Bas","Milieu","Haut","Moy","Fiab","O b s e r v a t i o n s"]
[1,null,null,null,null,null,null,null,"< Pt connu"]
[2,null,null,null,null,null,null,null,"< Pt connu"]
[3,null,null,null,null,null,null,null,"< Pt connu"]
[4]
[5]
[6]
[7]
[8]
[9]
[10]
[11]
[12]
[13]
[14]
[15]
[16]
[17]
[18]
[19]
[20]
[21]
[22]
[23]
[24]
[25]
[26]
[27]
[28]
[29]
[30]
[31]
[32]
[33]
[34]
[35]
[36]
[37]
[38]
[39]
[40]
[41]

{"sheet":"Protocole de terrain vierge","index":7,"n_rows":60,"n_cols":8,"rows_kept":60,"cut":false,"hidden":false,"merged":[]}
[null,null,null,"Relevé des points  au niveau, en station libre vers deux points connus."]
[]
[null,"Affaire:",null,null,"Opérateurs"]
[]
[null,"Date",null,null,"Instrument"]
[null,null,"Choisir: Deg / Grad"]
[null,"Unité"]
[]
["Li","Numéro","Direction","Bas","Milieu","Haut",null,"            O b s e r v a t i o n s"]
[1,null,null,null,null,null,"< Pt connu"]
[2,null,null,null,null,null,"< Pt connu"]
[3,null,null,null,null,null,"< Pt connu"]
[4]
[5]
[6]
[7]
[8]
[9]
[10]
[11]
[12]
[13]
[14]
[15]
[16]
[17]
[18]
[19]
[20]
[21]
[22]
[23]
[24]
[25]
[26]
[27]
[28]
[29]
[30]
[31]
[32]
[33]
[34]
[35]
[36]
[37]
[38]
[39]
[40]
[41]
[42]
[43]
[44]
[45]
[46]
[47]
[48]
[49]
[50]
[51]

{"sheet":"Protocole de terrain","index":8,"n_rows":60,"n_cols":8,"rows_kept":60,"cut":false,"hidden":false,"merged":[]}
[null,null,null,"Relevé des points  au niveau, en station libre vers deux points connus."]
[]
[null,"Affaire:",null,null,"Opérateurs"]
[]
[null,"Date",null,null,"Instrument"]
[null,null,"Choisir: Deg / Grad"]
[null,"Unité"]
[]
["Li","Numéro","Direction","Bas","Milieu","Haut",null,"            O b s e r v a t i o n s"]
[1,8001,0,"0613","0690","0767","< Pt connu","borne"]
[2,8016,104.6,1582,1690,"1797","< Pt connu","borne"]
[3,8012,164.5,2565,2650,"2733","< Pt connu","borne"]
[4,2,376.1,808,"0850","0891",null,"arbre"]
[5,3,345.3,970,1000,"1030",null,"arbre"]
[6,4,338,1193,1250,"1307",null,"arbre"]
[7,5,335,1081,1100,"1119",null,"mur en bas"]
[8,6,323.5,1327,1400,"1473",null,"mur en bas"]
[9,7,299.10000000000002,2959,3080,"3201",null,"borne"]
[10,8,294.5,2616,2700,"2784",null,"arbre"]
[11,9,288,1272,1300,"1328",null,"mur en bas"]
[12,10,265.2,"0988",1000,"1012",null,"place"]
[13,11,172,2363,2450,"2537",null,"arbre"]
[14,13,160.19999999999999,2391,2500,"2609",null,"arbre"]
[15,14,154.30000000000001,1787,1850,"1912",null,"batiment"]
[16,15,109,1796,1850,"1904",null,"batiment"]
[17,17,92.8,1336,1400,"1464",null,"arbre"]
[18,18,56.5,"0772","0800","0828",null,"place"]
[19,19,48.7,"0719","0780","0840",null,"entree"]
[20,20,38,"0719","0780","0840",null,"entree"]
[21,21,255.1,2485,2550,"2615",null,"terrain"]
[22,22,214.9,2535,2600,"2664",null,"terrain"]
[23]
[24]
[25]
[26]
[27]
[28]
[29]
[30]
[31]
[32]
[33]
[34]
[35]
[36]
[37]
[38]
[39]
[40]
[41]
[42]
[43]
[44]
[45]
[46]
[47]
[48]
[49]
[50]
[51]